بازرسی پیش از پرواز
type: Concept
broader: بازرسی
preferred label: preflight inspection @en
scope note: یکی از بازرسی‌هایی که خدمۀ پرواز یا خدمۀ زمینی پیش از شروع پرواز انجام می‌دهند تا از سلامت هواگَرد اطمینان یابند.

بازرسی
type: Concept
narrower: بازرسی پیش از پرواز
preferred label: inspection @en