میانای فراهم‌ساز خدمات
type: Concept
broader: واسط (رایانه)
preferred label: service provider interface @en
scope note: صفحۀ ورودی نرم‌افزار فراهم‌ساز خدمات که کارکردهای پردازشی خاصی را برای کاربر فراهم می‌کند.

واسط (رایانه)
type: Concept
narrower: میانای فراهم‌ساز خدمات
preferred label: interface (computer) @en