پوست‌کلید
type: Concept
broader: واسط کاربر
preferred label: skinput @en
scope note: نوعی واسط کاربری با فنّاوری طبیعی که براساس حسگرهای پوستی انسان کار می‌کند و امکان می‌دهد بدن با استفاده از حسگر زیست‌‌ ـ صوتی (bio-acoustic sensor) پوشیدنی نقش ورودی را ایفا کند.

واسط کاربر
type: Concept
narrower: پوست‌کلید
preferred label: user interface @en