تابش‌دهی ایزوتوپی
type: Concept
broader: تابش‌دهی
preferred label: isotopic irradiation @en
scope note: فرایندی که در آن نمونه‌ای را تحت تأثیر تابش یوننده قرار می‌دهند.

تابش‌دهی
type: Concept
narrower: تابش‌دهی ایزوتوپی
preferred label: irradiation @en