مهار بالتیکی
type: Concept
broader: مهارافزار
preferred label: Baltic moor @en
scope note: وعی مهار شناور که در آن یک طناب یا بافه به سر لنگر بسته می‌شود و پس از انداختن لنگر و حرکت جانبی به‌سمت اسکله، شناور از سمت اسکله با طناب مهار می‌شود.

مهارافزار
type: Concept
narrower: مهار بالتیکی
preferred label: moorings @en