غلاف مهار
type: Concept
broader: مهارافزار
preferred label: mooring mat @en
scope note: غلافی از الیاف بسیار ستبر و محکم که برای جلوگیری از فرسایش طناب مهار به دور آن می‌پیچند.

مهارافزار
type: Concept
narrower: غلاف مهار
preferred label: moorings @en