پیچ ‌مهار
type: Concept
broader: مهارافزار
preferred label: mooring screw @en
scope note: میله‌ای پیچ‌مانند که برای مهار شناور بدون استفاده از لنگر یا بستن شناوه‌ها/ بویه‌ها به کف نرم رودخانه یا دریاچه‌ها به کار می‌رود.

مهارافزار
type: Concept
narrower: پیچ ‌مهار
preferred label: moorings @en