لاک‌الکل
type: Concept
broader: لاک
preferred label: spirit lacquer @en
scope note: لاکی که از حل کردن رزین‌ها در الکل صنعتی به دست می‌آید.

لاک
type: Concept
narrower: لاک‌الکل
preferred label: lacquer @en