زمین‌لغزه چرخشی
type: Concept
broader: زمین‌لغزه
preferred label: rotational landslide @en
scope note: زمین‌لغزه‌ای که در آن برش در امتداد سطحی منحنی رخ داده است.

زمین‌لغزه
type: Concept
narrower: زمین‌لغزه چرخشی
preferred label: landslide @en