دروگر علوفه
type: Concept
broader: ماشین درو
preferred label: forage harvester @en
scope note: ماشینی که علوفه را درو می‌کند یا علوفۀ دروشده را از زمین برمی‌دارد و پس از خرد کردن و بسته‌بندی به وسیلۀ نقلیۀ دیگری منتقل می‌کند.

ماشین درو
type: Concept
narrower: دروگر علوفه
preferred label: harvester @en