فشرده‌ساز مرکزگریز
type: Concept
broader: فشرده‌ساز
preferred label: centrifugal flow compressor @en
scope note: نوعی فشرده‌ساز در موتورهای توربین گازی با پروانه‌های پیچی

فشرده‌ساز
type: Concept
narrower: فشرده‌ساز مرکزگریز
preferred label: compressor @en