نگهداری تکمیلی
type: Concept
broader: نگهداری نرم‌افزار
preferred label: perfective maintenance @en
scope note: یکی از انواع نگهداری نرم‌افزار که در آن ویژگی‌ها یا کارکردهای تازه‌ای را به‌ سامانه اضافه می‌کنند تا عملکرد آن را بهبود بخشند.

نگهداری نرم‌افزار
type: Concept
narrower: نگهداری تکمیلی
preferred label: software maintenance @en