مدیریت مراقبت سلامت
type: Concept
broader: مدیریت سلامت
preferred label: health care management @en
scope note: هماهنگی و هدایت فعالیت‌ها در مراکز مراقبت سلامت برای دست یافتن به هدف‌ها و مقاصد اعلام‌شده

مدیریت سلامت
type: Concept
narrower: مدیریت مراقبت سلامت
preferred label: health management @en