مدیریت نوآوری
type: Concept
broader: مدیریت
preferred label: innovation management @en
scope note: برنامه‌ریزی و سازمان‌دهی و هدایت و واپایش فرایند نوآوری از بروز اندیشۀ خلاق آغازین تا ارزش‌افزایی و رسیدن به محصول نهایی

مدیریت
type: Concept
narrower: مدیریت نوآوری
preferred label: management @en