مدیریت کلید
type: Concept
broader: مدیریت
preferred label: key management @en
scope note: فرایند ساماندهی و واپایش کلیدهای رمزنگاری، شامل ایجاد و ذخیره‌سازی و توزیع و حذف و بایگانی و به‌کارگیری کلیدها براساس خطِ‌مشی امنیتی

مدیریت
type: Concept
narrower: مدیریت کلید
preferred label: management @en