نقشه راداری
type: Concept
broader: نقشه
preferred label: radar map @en
related: رادار
scope note: اطلاعات نقشه‌نگاشتی برهم‌نموده بر روی صفحۀ رادار برای نمایش آسان‌تر ویژگی‌های تعیین‌شده

نقشه
type: Concept
narrower: نقشه راداری
preferred label: map @en

رادار
type: Concept
preferred label: radar @en
related: نقشه راداری