نقشه ایستا
type: Concept
broader: نقشه
preferred label: static map @en
scope note: نقشه‌ای که اطلاعات مربوط به یک زمان مشخص را ارائه می‌دهد.

نقشه
type: Concept
narrower: نقشه ایستا
preferred label: map @en