نیم‌رسانای اریخت
type: Concept
broader: مواد اریخت
preferred label: amorphous semiconductor @en
scope note: مادۀ نیم‌رسانایی که ساختار بلوری ندارد و رسانایی الکتریکی آن کمتر از نیم‌رسانای بلوری است.

مواد اریخت
type: Concept
narrower: نیم‌رسانای اریخت
preferred label: amorphous materials @en