افزودنی‌های غذایی
type: Concept
narrower: ماده ضدبیاتی
preferred label: food additives @en

ماده ضدبیاتی
type: Concept
alternative label: ضدبیاتی
broader: افزودنی‌های غذایی
preferred label: antistaling agent @en
scope note: نوعی افزودنی غذایی که باعث تأخیر در بیاتی محصولات نانوایی می‌شود.