چنگالنده
type: Concept
broader: عامل
preferred label: chelating agent @en
scope note: ماده‌ای که با اتصال به یون‌های فلزی ساختار حلقه‌ای پایدارتر تشکیل می‌دهد.

عامل
type: Concept
narrower: چنگالنده
preferred label: agent @en