کاتالیزگر
type: Concept
preferred label: catalyst @en
related: عامل تراکم

عامل تراکم
type: Concept
broader: عامل
preferred label: condensation agent @en
related: کاتالیزگر
scope note: نوعی ترکیب شیمیایی که به‌عنوان کاتالیزگر به پیشرفت واکنش کمک می‌کند.

عامل
type: Concept
narrower: عامل تراکم
preferred label: agent @en