جرم‌زدایی
type: Concept
preferred label: descaling @en
related: بازدارنده اسیدی

بازدارنده اسیدی
type: Concept
broader: بازدارنده خوردگی
preferred label: acid inhibitor @en
related: جرم‌زدایی
scope note: نوعی بازدارندۀ خوردگی غالباً از جنس مواد آلی حاوی نیتروژن و گوگرد و دارای بار قطبی که جذب سطح فلز می‌شود و از حملۀ اسید به سطح عریان فلز در هنگام پوسته‌زدایی (descaling) محافظت می‌کند.

بازدارنده خوردگی
type: Concept
narrower: بازدارنده اسیدی
preferred label: corrosion inhibitor @en