عامل پخت مهارشده
type: Concept
broader: عامل پخت
preferred label: blocked curing agent @en
scope note: عامل پختی که ایزوسیانات را واکنش‌ناپذیر نگه می‌دارد و در صورت لزوم به روش‌های فیزیکی یا شیمیایی واکنش‌پذیر می‌شود.

عامل پخت
type: Concept
narrower: عامل پخت مهارشده
preferred label: curing agent (polymer) @en