عامل برگ‌ریز
type: Concept
broader: عامل
preferred label: defoliating agent @en
scope note: ماده‌ای شیمیایی که باعث ریزش زودرس برگ گیاهان می‌شود.

عامل
type: Concept
narrower: عامل برگ‌ریز
preferred label: agent @en