پروتئین
type: Concept
preferred label: protein @en
related: عامل واسرشتن

عامل واسرشتن
type: Concept
broader: عامل
preferred label: denaturing agent @en
related: پروتئین
scope note: عاملی که خواص پروتئین را در محلول آبی تغییر می‌دهد.

عامل
type: Concept
narrower: عامل واسرشتن
preferred label: agent @en