ماده خشک‌کن
type: Concept
broader: عامل
preferred label: desiccant @en
scope note: ماده‌ای که بتواند بخار آب موجود در یک محیط بسته را جذب کند.

عامل
type: Concept
narrower: ماده خشک‌کن
preferred label: agent @en