پراکنش
type: Concept
preferred label: dispersion @en
related: عامل پراکنش

عامل پراکنش
type: Concept
alternative label: پراکنش‌یار
broader: عامل
preferred label: dispersing agent @en
related: پراکنش
scope note: یکی از افزودنی‌های مورد استفاده در تولید پراکنه‌ها که وظیفۀ آن آسان‌سازی پراکنش اجزای جامد در فاز مایع و افزایش پایداری مخلوط است.

عامل
type: Concept
narrower: عامل پراکنش
preferred label: agent @en