عامل هسته‌زایی
type: Concept
broader: عامل
preferred label: nucleating agent @en
scope note: عاملی که هسته‌ها را برای تبلور فراهم می‌کند.

عامل
type: Concept
narrower: عامل هسته‌زایی
preferred label: agent @en