عامل حل‌پذیرساز
type: Concept
broader: عامل
preferred label: solubilizing agent @en
scope note: هر ماده‌ای که به حل‌پذیری مواد کمک ‌کند.

عامل
type: Concept
narrower: عامل حل‌پذیرساز
preferred label: agent @en