رزانه بازی
type: Concept
broader: رزانه
preferred label: basic dye @en
scope note: رزانه‌ای که به دلیل وجود آنیلین یا گروه‌های مشابه در آن تا حدی خواص بازی دارد.

رزانه
type: Concept
narrower: رزانه بازی
preferred label: dye @en