رزانه‌های رزدانه‌ای
type: Concept
broader: رزانه
preferred label: lake dyes @en
scope note: دسته‌ای از رَزانه‌ها که با نمک‌های کلسیم، باریم،‌ کروم یا آلومینیم ترکیب یا جذب آنها می‌شوند و رَزدانه ایجاد می‌کنند.

رزانه
type: Concept
narrower: رزانه‌های رزدانه‌ای
preferred label: dye @en