اسید
type: Concept
preferred label: acid @en
related: حلال پروتون‌زا

حلال پروتون‌زا
type: Concept
broader: حلال
preferred label: protogenic solvent @en
related: اسید
scope note: حلاّلی که به‌عنوان یک اسید ضعیف یا قوی توانایی پروتون‌دهی دارد.

حلال
type: Concept
narrower: حلال پروتون‌زا
preferred label: solvent @en