کود کامل
type: Concept
broader: کود شیمیایی
preferred label: complete fertilizer @en
scope note: کودی که عناصر نیتروژن و فسفر و پتاسیم دارد.

کود شیمیایی
type: Concept
narrower: کود کامل
preferred label: chemical fertilizer @en