دوده‌کود
type: Concept
broader: کود
preferred label: soot fertilizer @en
scope note: دودۀ چوب یا زغال که به دلیل ارزش غذایی آن به خاک اضافه می‌شود.

کود
type: Concept
narrower: دوده‌کود
preferred label: fertilizer @en