کود راه‌انداز
type: Concept
broader: کود
preferred label: starter fertilizer @en
scope note: کودی که در مقادیر کم به خاک اضافه می‌شود تا رشد اولیۀ گیاهان به‌ویژه نیامداران را تسریع کند

کود
type: Concept
narrower: کود راه‌انداز
preferred label: fertilizer @en