کاغذ گچ‌رنگ
type: Concept
broader: کاغذ
preferred label: pastel paper @en
scope note: کاغذ پرزداری که برای کار با گچ‌رنگ به کار می‌رود.

کاغذ
type: Concept
narrower: کاغذ گچ‌رنگ
preferred label: paper @en