پوشانش پودری
type: Concept
preferred label: powder coating @en
related: پودر پوشانش

پودر پوشانش
type: Concept
broader: پودر
preferred label: powder coatings @en
related: پوشانش پودری
scope note: نوعی مادۀ پوششی صددرصد جامد که به‌صورت پودر خشک به کار می‌رود و پس از پخت در دمای بالا ذوب می‌شود و فیلم (film) پیوسته‌ای تشکیل می‌دهد.

پودر
type: Concept
narrower: پودر پوشانش
preferred label: powder @en