لاستیک
type: Concept
narrower: لاستیک احیا‌شده
preferred label: rubber @en

لاستیک احیا‌شده
type: Concept
alternative label: بازلاستیک
broader: لاستیک
preferred label: reclaimed rubber @en
scope note: لاستیک ولکانیده‌ای که با روش‌های مکانیکی یا شیمیایی نرم‌شده و بخشی از آن واولکانیده (devulcanised) شده است.