رسوب سنگ‌زاد
type: Concept
broader: رسوب
preferred label: lithogenous sediment @en
scope note: رسوباتی متشکل از ترکیبات معدنی که در نتیجۀ هوازدگی صخره‌ها ایجاد می‌شوند.

رسوب
type: Concept
narrower: رسوب سنگ‌زاد
preferred label: sediment @en