طیف‌سنجی جرمی محیطی
type: Concept
broader: طیف‌سنجی جرمی
preferred label: ambient mass spectrometry @en
scope note: نوعی طیف‌سنجی جِرمی که در آن یونش در فشار و دمای محیط رخ می‌دهد.

طیف‌سنجی جرمی
type: Concept
narrower: طیف‌سنجی جرمی محیطی
preferred label: mass spectrometry @en