طیف‌سنجی انرژی جنبشی جرمی یون
type: Concept
broader: طیف‌سنجی جرمی
preferred label: mass-analysed ion kinetic energy spectrometry @en
scope note: نوعی طیف‌سنجی انرژی جنبشی یون که در آن جِرم محصولات یونی ازطریق اندازه‌گیری انرژی جنبشی یونی تعیین می‌شود.

طیف‌سنجی جرمی
type: Concept
narrower: طیف‌سنجی انرژی جنبشی جرمی یون
preferred label: mass spectrometry @en