طیف‌سنجی جرمی واجذبش پلاسما
type: Concept
broader: طیف‌سنجی جرمی
preferred label: plasma desorption mass spectrometry @en
scope note: روشی در طیف‌سنجی جرمی برای تجزیۀ مولکول‌های نافرّار به‌ویژه مولکول‌های سنگین با وزن اتمی بیش از 2000 که در آن یون‌های سنگین با انرژی در مرتبۀ 100 مگا‌الکترون‌ولت در فیلم‌های نازک نفوذ می‌کنند و با دادن انرژی موجب واکنش شیمیایی و درنتیجه تشکیل یون‌های مولکولی و امواج تکانه‌ای و به‌دنبال آن پرتاب یون‌ها از سطح می‌شوند.

طیف‌سنجی جرمی
type: Concept
narrower: طیف‌سنجی جرمی واجذبش پلاسما
preferred label: mass spectrometry @en