یون
type: Concept
preferred label: ion @en
related: طیف‌سنجی افت انرژی انتقالی

طیف‌سنجی افت انرژی انتقالی
type: Concept
broader: طیف‌سنجی جرمی
preferred label: translational energy loss spectrometry @en
related: یون
scope note: نوعی طیف‌سنجی جِرمی که در آن برخوردهای پرانرژی میان یک یون و یک هدف خنثی که به تغییر انرژی درونی یون می‌انجامد بررسی می‌شود.

طیف‌سنجی جرمی
type: Concept
narrower: طیف‌سنجی افت انرژی انتقالی
preferred label: mass spectrometry @en