طیف‌سنجی پرتو ایکس
type: Concept
broader: طیف‌سنجی
preferred label: X-ray spectrometry @en
related: پرتو ایکس
scope note: اندازه‌گیری و تحلیل پراش پرتو ایکس تولیدشده از بلورها

طیف‌سنجی
type: Concept
narrower: طیف‌سنجی پرتو ایکس
preferred label: spectrometry @en

پرتو ایکس
type: Concept
preferred label: X ray @en
related: طیف‌سنجی پرتو ایکس