کرنش زاویه‌ای
type: Concept
broader: کرنش
preferred label: angle strain @en
scope note: حالتی که در آن زاویۀ پیوند از مقدار معمول آن دور شده باشد.

کرنش
type: Concept
narrower: کرنش زاویه‌ای
preferred label: strain @en