اصطکاک لغزشی
type: Concept
broader: اصطکاک
preferred label: sliding friction @en
scope note: نیروی اصطکاک بین دو سطحی که بر روی هم می‌لغزند.

اصطکاک
type: Concept
narrower: اصطکاک لغزشی
preferred label: friction @en