اصطکاک ایستایی
type: Concept
broader: اصطکاک
preferred label: static friction @en
scope note: نیروی اصطکاک بین دو سطحِ درحال‌تماس وقتی که نسبت به هم ساکن باشند.

اصطکاک
type: Concept
narrower: اصطکاک ایستایی
preferred label: friction @en