پسار قاعده
type: Concept
broader: پسار
preferred label: base drag @en
scope note: پسار ناشی از فشار کاهیدۀ (reduced pressure) وارد بر سطح قاعده

پسار
type: Concept
narrower: پسار قاعده
preferred label: drag @en