پسار قوس
type: Concept
broader: پسار
preferred label: curve drag @en
related: راه‌آهن
scope note: نیروی مقاوم در برابر حرکت قطار در هنگام عبور از قوس

پسار
type: Concept
narrower: پسار قوس
preferred label: drag @en

راه‌آهن
type: Concept
preferred label: railroad @en
related: پسار قوس