پسار لبه چرخ
type: Concept
broader: پسار
preferred label: flange drag @en
related: راه‌آهن
scope note: نیروی مقاوم در برابر حرکت که با سرعت قطار و سختی قائم سازۀ خط آهن نسبت مستقیم دارد.

پسار
type: Concept
narrower: پسار لبه چرخ
preferred label: drag @en

راه‌آهن
type: Concept
preferred label: railroad @en
related: پسار لبه چرخ